FailedConsole Output

View as plain text
Started by an SCM change
ln -s 2014-12-09_08-20-58 /data/live/Hudson/jobs/3DAssembler/builds/287 failed: -1 
Updating file:///data/live/SVN/external/open-source/3DAssembler/trunk
A         archive
AU        archive/3DAssembler-1.0.0b35.zip
AU        archive/3DAssembler-2.2.1b469.zip
AU        archive/3DAssembler-1.1.0b50.zip
AU        archive/3DAssembler-1.4.0b140.zip
AU        archive/3DAssembler-2.0.0b396.zip
AU        archive/3DAssembler-0.3.0b31.zip
AU        archive/3DAssembler-0.2.0b22.zip
AU        archive/3DAssembler-2.1.0b422.zip
AU        archive/3DAssembler-1.3.0b125.zip
AU        archive/3DAssembler-2.2.0b466.zip
AU        archive/3DAssembler-2.2.1b476.zip
U         README
At revision 647
[workspace] $ ant -Dfindbugs.home=/opt/findbugs clean findbugs test
Buildfile: /data/live/Hudson/jobs/3DAssembler/workspace/build.xml

clean:
   [delete] Deleting directory /data/live/Hudson/jobs/3DAssembler/workspace/classes
   [delete] Deleting directory /data/live/Hudson/jobs/3DAssembler/workspace/src/mark/assemble3d/j2dimages
   [delete] Deleting: /data/live/Hudson/jobs/3DAssembler/workspace/3DAssembler.jar

prepare:
    [mkdir] Created dir: /data/live/Hudson/jobs/3DAssembler/workspace/classes/dev

build.number:
[propertyfile] Updating property file: /data/live/Hudson/jobs/3DAssembler/workspace/src/mark/assemble3d/resources/version.info
[propertyfile] Updating property file: /data/live/Hudson/jobs/3DAssembler/workspace/src/appdeath.config

svg2java:
    [mkdir] Created dir: /data/live/Hudson/jobs/3DAssembler/workspace/src/mark/assemble3d/j2dimages
     [java] Converting New.svg... Done
     [java] Converting SideBySide.svg... Done
     [java] Converting Portrait.svg... Done
     [java] Converting App.svg... Done
     [java] Converting Switch.svg... Done
     [java] Converting Reset.svg... Done
     [java] Converting CustomAnaglyph.svg... Done
     [java] Converting Parallel.svg... Done
     [java] Converting CropRight.svg... Done
     [java] Converting Overlayed.svg... Done
     [java] Converting CropLeft.svg... Done
     [java] Converting Open.svg... Done
     [java] Converting Auto.svg... Done
     [java] Converting ZoomIn.svg... Done
     [java] Converting RightView.svg... Done
     [java] Converting Save.svg... Done
     [java] Converting Horizontally.svg... Done
     [java] Converting Landscape.svg... Done
     [java] Converting Vertically.svg... Done
     [java] Converting ZoomOut.svg... Done
     [java] Converting Macro.svg... Done
     [java] Converting Preview.svg... Done
     [java] Converting GreenMagenta.svg... Done
     [java] Converting CrossEyed.svg... Done
     [java] Converting None.svg... Done
     [java] Converting CropBottom.svg... Done
     [java] Converting Zoom.svg... Done
     [java] Converting CropTop.svg... Done
     [java] Converting Internet.svg... Done
     [java] Converting Delete.svg... Done
     [java] Converting RedCyan.svg... Done
     [java] Converting AmberBlue.svg... Done
     [java] Converting LeftView.svg... Done
     [java] Converting Rotate.svg... Done
     [java] Converting RedChannel.svg... Done
     [java] Converting GreenChannel.svg... Done
     [java] Converting Formatting.svg... Done
     [java] Converting BlueChannel.svg... Done

compile:
    [javac] /data/live/Hudson/jobs/3DAssembler/workspace/build.xml:99: warning: 'includeantruntime' was not set, defaulting to build.sysclasspath=last; set to false for repeatable builds
    [javac] Compiling 57 source files to /data/live/Hudson/jobs/3DAssembler/workspace/classes
    [javac] /data/live/Hudson/jobs/3DAssembler/workspace/src/mark/assemble3d/ImageType.java:172: warning: [deprecation] edu.umd.cs.findbugs.annotations.CheckForNull in edu.umd.cs.findbugs.annotations has been deprecated
    [javac] 	@edu.umd.cs.findbugs.annotations.CheckForNull
    [javac] 	                                ^
    [javac] /data/live/Hudson/jobs/3DAssembler/workspace/src/mark/assemble3d/Utils.java:52: warning: [deprecation] edu.umd.cs.findbugs.annotations.CheckForNull in edu.umd.cs.findbugs.annotations has been deprecated
    [javac] 	@edu.umd.cs.findbugs.annotations.CheckForNull public static Dimension getSizeWithin(BufferedImage img, Dimension d)
    [javac] 	                                ^
    [javac] /data/live/Hudson/jobs/3DAssembler/workspace/src/mark/assemble3d/Utils.java:68: warning: [deprecation] edu.umd.cs.findbugs.annotations.CheckForNull in edu.umd.cs.findbugs.annotations has been deprecated
    [javac] 	@edu.umd.cs.findbugs.annotations.CheckForNull public static BufferedImage fitWithin(BufferedImage img, Dimension d, Object hint, boolean higherQuality)
    [javac] 	                                ^
    [javac] 3 warnings

resources:
     [copy] Copying 5 files to /data/live/Hudson/jobs/3DAssembler/workspace/classes/mark/assemble3d/resources
     [copy] Copying 1 file to /data/live/Hudson/jobs/3DAssembler/workspace/classes

jar:
      [jar] Building jar: /data/live/Hudson/jobs/3DAssembler/workspace/3DAssembler.jar

findbugs:
 [findbugs] Executing findbugs from ant task
 [findbugs] Running FindBugs...
 [findbugs] Warnings generated: 3
 [findbugs] Calculating exit code...
 [findbugs] Setting 'bugs found' flag (1)
 [findbugs] Exit code set to: 1
 [findbugs] Java Result: 1
 [findbugs] Output saved to findbugs.xml

prepare:

build.number:
[propertyfile] Updating property file: /data/live/Hudson/jobs/3DAssembler/workspace/src/mark/assemble3d/resources/version.info
[propertyfile] Updating property file: /data/live/Hudson/jobs/3DAssembler/workspace/src/appdeath.config

svg2java:

compile:
    [javac] /data/live/Hudson/jobs/3DAssembler/workspace/build.xml:99: warning: 'includeantruntime' was not set, defaulting to build.sysclasspath=last; set to false for repeatable builds

resources:
     [copy] Copying 1 file to /data/live/Hudson/jobs/3DAssembler/workspace/classes/mark/assemble3d/resources
     [copy] Copying 1 file to /data/live/Hudson/jobs/3DAssembler/workspace/classes

jar:

BUILD FAILED
/data/live/Hudson/jobs/3DAssembler/workspace/build.xml:121: Property 'jar.classpath' already set!

Total time: 51 seconds
Build step 'Invoke Ant' marked build as failure
[FINDBUGS] Skipping publisher since build result is FAILURE
[WARNINGS] Skipping publisher since build result is FAILURE
Recording test results
Finished: FAILURE