FailedConsole Output

View as plain text
Started by user Mark Greenwood
Updating file:///data/live/SVN/external/open-source/DateParser/trunk
At revision 552
no change for file:///data/live/SVN/external/open-source/DateParser/trunk since the previous build
[workspace] $ ant -Dfindbugs.home=/opt/findbugs clean findbugs test javadoc
Buildfile: /data/live/Hudson/jobs/Date Parser/workspace/build.xml

clean:
   [delete] Deleting directory /data/live/Hudson/jobs/Date Parser/workspace/classes
   [delete] Deleting: /data/live/Hudson/jobs/Date Parser/workspace/DateParser.jar
   [delete] Deleting directory /data/live/Hudson/jobs/Date Parser/workspace/test/classes
   [delete] Deleting directory /data/live/Hudson/jobs/Date Parser/workspace/test/reports

prepare:
    [mkdir] Created dir: /data/live/Hudson/jobs/Date Parser/workspace/classes

compile:
    [javac] /data/live/Hudson/jobs/Date Parser/workspace/build.xml:40: warning: 'includeantruntime' was not set, defaulting to build.sysclasspath=last; set to false for repeatable builds
    [javac] Compiling 2 source files to /data/live/Hudson/jobs/Date Parser/workspace/classes

jar:
      [jar] Building jar: /data/live/Hudson/jobs/Date Parser/workspace/DateParser.jar

findbugs:
 [findbugs] Executing findbugs from ant task
 [findbugs] Running FindBugs...
 [findbugs] Calculating exit code...
 [findbugs] Exit code set to: 0
 [findbugs] Output saved to findbugs.xml

prepare:

compile:

jar:

test:
    [mkdir] Created dir: /data/live/Hudson/jobs/Date Parser/workspace/test/classes
    [javac] /data/live/Hudson/jobs/Date Parser/workspace/build.xml:67: warning: 'includeantruntime' was not set, defaulting to build.sysclasspath=last; set to false for repeatable builds
    [javac] Compiling 1 source file to /data/live/Hudson/jobs/Date Parser/workspace/test/classes
    [javac] DateParserTest.java:21: package org.junit does not exist
    [javac] import static org.junit.Assert.assertEquals;
    [javac]                        ^
    [javac] DateParserTest.java:21: static import only from classes and interfaces
    [javac] import static org.junit.Assert.assertEquals;
    [javac] ^
    [javac] DateParserTest.java:22: package org.junit does not exist
    [javac] import static org.junit.Assert.assertNotNull;
    [javac]                        ^
    [javac] DateParserTest.java:22: static import only from classes and interfaces
    [javac] import static org.junit.Assert.assertNotNull;
    [javac] ^
    [javac] DateParserTest.java:23: package org.junit does not exist
    [javac] import static org.junit.Assert.assertNull;
    [javac]                        ^
    [javac] DateParserTest.java:23: static import only from classes and interfaces
    [javac] import static org.junit.Assert.assertNull;
    [javac] ^
    [javac] DateParserTest.java:30: package org.junit does not exist
    [javac] import org.junit.AfterClass;
    [javac]                 ^
    [javac] DateParserTest.java:31: package org.junit does not exist
    [javac] import org.junit.BeforeClass;
    [javac]                 ^
    [javac] DateParserTest.java:32: package org.junit does not exist
    [javac] import org.junit.Test;
    [javac]                 ^
    [javac] DateParserTest.java:42: cannot find symbol
    [javac] symbol  : class BeforeClass
    [javac] location: class mark.util.DateParserTest
    [javac] 	@BeforeClass
    [javac] 	 ^
    [javac] DateParserTest.java:49: cannot find symbol
    [javac] symbol  : class AfterClass
    [javac] location: class mark.util.DateParserTest
    [javac] 	@AfterClass
    [javac] 	 ^
    [javac] DateParserTest.java:56: cannot find symbol
    [javac] symbol  : class Test
    [javac] location: class mark.util.DateParserTest
    [javac] 	@Test
    [javac] 	 ^
    [javac] DateParserTest.java:72: cannot find symbol
    [javac] symbol  : class Test
    [javac] location: class mark.util.DateParserTest
    [javac] 	@Test
    [javac] 	 ^
    [javac] DateParserTest.java:88: cannot find symbol
    [javac] symbol  : class Test
    [javac] location: class mark.util.DateParserTest
    [javac] 	@Test
    [javac] 	 ^
    [javac] DateParserTest.java:106: cannot find symbol
    [javac] symbol  : class Test
    [javac] location: class mark.util.DateParserTest
    [javac] 	@Test
    [javac] 	 ^
    [javac] DateParserTest.java:124: cannot find symbol
    [javac] symbol  : class Test
    [javac] location: class mark.util.DateParserTest
    [javac] 	@Test
    [javac] 	 ^
    [javac] DateParserTest.java:142: cannot find symbol
    [javac] symbol  : class Test
    [javac] location: class mark.util.DateParserTest
    [javac] 	@Test
    [javac] 	 ^
    [javac] DateParserTest.java:158: cannot find symbol
    [javac] symbol  : class Test
    [javac] location: class mark.util.DateParserTest
    [javac] 	@Test
    [javac] 	 ^
    [javac] DateParserTest.java:174: cannot find symbol
    [javac] symbol  : class Test
    [javac] location: class mark.util.DateParserTest
    [javac] 	@Test
    [javac] 	 ^
    [javac] DateParserTest.java:190: cannot find symbol
    [javac] symbol  : class Test
    [javac] location: class mark.util.DateParserTest
    [javac] 	@Test
    [javac] 	 ^
    [javac] DateParserTest.java:206: cannot find symbol
    [javac] symbol  : class Test
    [javac] location: class mark.util.DateParserTest
    [javac] 	@Test
    [javac] 	 ^
    [javac] DateParserTest.java:222: cannot find symbol
    [javac] symbol  : class Test
    [javac] location: class mark.util.DateParserTest
    [javac] 	@Test
    [javac] 	 ^
    [javac] DateParserTest.java:234: cannot find symbol
    [javac] symbol  : class Test
    [javac] location: class mark.util.DateParserTest
    [javac] 	@Test
    [javac] 	 ^
    [javac] DateParserTest.java:246: cannot find symbol
    [javac] symbol  : class Test
    [javac] location: class mark.util.DateParserTest
    [javac] 	@Test
    [javac] 	 ^
    [javac] DateParserTest.java:258: cannot find symbol
    [javac] symbol  : class Test
    [javac] location: class mark.util.DateParserTest
    [javac] 	@Test
    [javac] 	 ^
    [javac] DateParserTest.java:266: cannot find symbol
    [javac] symbol  : class Test
    [javac] location: class mark.util.DateParserTest
    [javac] 	@Test
    [javac] 	 ^
    [javac] DateParserTest.java:280: cannot find symbol
    [javac] symbol  : class Test
    [javac] location: class mark.util.DateParserTest
    [javac] 	@Test
    [javac] 	 ^
    [javac] DateParserTest.java:292: cannot find symbol
    [javac] symbol  : class Test
    [javac] location: class mark.util.DateParserTest
    [javac] 	@Test
    [javac] 	 ^
    [javac] DateParserTest.java:304: cannot find symbol
    [javac] symbol  : class Test
    [javac] location: class mark.util.DateParserTest
    [javac] 	@Test
    [javac] 	 ^
    [javac] DateParserTest.java:316: cannot find symbol
    [javac] symbol  : class Test
    [javac] location: class mark.util.DateParserTest
    [javac] 	@Test
    [javac] 	 ^
    [javac] DateParserTest.java:330: cannot find symbol
    [javac] symbol  : class Test
    [javac] location: class mark.util.DateParserTest
    [javac] 	@Test
    [javac] 	 ^
    [javac] DateParserTest.java:62: cannot find symbol
    [javac] symbol  : method assertNotNull(java.util.Date)
    [javac] location: class mark.util.DateParserTest
    [javac] 		assertNotNull(d);
    [javac] 		^
    [javac] DateParserTest.java:67: cannot find symbol
    [javac] symbol  : method assertEquals(java.lang.String,java.lang.String)
    [javac] location: class mark.util.DateParserTest
    [javac] 		assertEquals(today, formatted);
    [javac] 		^
    [javac] DateParserTest.java:68: cannot find symbol
    [javac] symbol  : method assertEquals(int,int)
    [javac] location: class mark.util.DateParserTest
    [javac] 		assertEquals(pp.getIndex(), 5);
    [javac] 		^
    [javac] DateParserTest.java:69: cannot find symbol
    [javac] symbol  : method assertEquals(java.lang.Object,java.lang.String)
    [javac] location: class mark.util.DateParserTest
    [javac] 		assertEquals(pp.getFeatures().get("relative"), "present");
    [javac] 		^
    [javac] DateParserTest.java:78: cannot find symbol
    [javac] symbol  : method assertNotNull(java.util.Date)
    [javac] location: class mark.util.DateParserTest
    [javac] 		assertNotNull(d);
    [javac] 		^
    [javac] DateParserTest.java:83: cannot find symbol
    [javac] symbol  : method assertEquals(java.lang.String,java.lang.String)
    [javac] location: class mark.util.DateParserTest
    [javac] 		assertEquals(today, formatted);
    [javac] 		^
    [javac] DateParserTest.java:84: cannot find symbol
    [javac] symbol  : method assertEquals(int,int)
    [javac] location: class mark.util.DateParserTest
    [javac] 		assertEquals(pp.getIndex(), 5);
    [javac] 		^
    [javac] DateParserTest.java:85: cannot find symbol
    [javac] symbol  : method assertEquals(java.lang.Object,java.lang.String)
    [javac] location: class mark.util.DateParserTest
    [javac] 		assertEquals(pp.getFeatures().get("relative"), "present");
    [javac] 		^
    [javac] DateParserTest.java:97: cannot find symbol
    [javac] symbol  : method assertNotNull(java.util.Date)
    [javac] location: class mark.util.DateParserTest
    [javac] 		assertNotNull(tomorrow);
    [javac] 		^
    [javac] DateParserTest.java:101: cannot find symbol
    [javac] symbol  : method assertEquals(java.lang.String,java.lang.String)
    [javac] location: class mark.util.DateParserTest
    [javac] 		assertEquals(sTomorrow, "01/01/2001");
    [javac] 		^
    [javac] DateParserTest.java:102: cannot find symbol
    [javac] symbol  : method assertEquals(int,int)
    [javac] location: class mark.util.DateParserTest
    [javac] 		assertEquals(pp.getIndex(), 8);
    [javac] 		^
    [javac] DateParserTest.java:103: cannot find symbol
    [javac] symbol  : method assertEquals(java.lang.Object,java.lang.String)
    [javac] location: class mark.util.DateParserTest
    [javac] 		assertEquals(pp.getFeatures().get("relative"), "future");
    [javac] 		^
    [javac] DateParserTest.java:115: cannot find symbol
    [javac] symbol  : method assertNotNull(java.util.Date)
    [javac] location: class mark.util.DateParserTest
    [javac] 		assertNotNull(yesterday);
    [javac] 		^
    [javac] DateParserTest.java:119: cannot find symbol
    [javac] symbol  : method assertEquals(java.lang.String,java.lang.String)
    [javac] location: class mark.util.DateParserTest
    [javac] 		assertEquals(date, "31/12/2000");
    [javac] 		^
    [javac] DateParserTest.java:120: cannot find symbol
    [javac] symbol  : method assertEquals(int,int)
    [javac] location: class mark.util.DateParserTest
    [javac] 		assertEquals(pp.getIndex(), 9);
    [javac] 		^
    [javac] DateParserTest.java:121: cannot find symbol
    [javac] symbol  : method assertEquals(java.lang.Object,java.lang.String)
    [javac] location: class mark.util.DateParserTest
    [javac] 		assertEquals(pp.getFeatures().get("relative"), "past");
    [javac] 		^
    [javac] DateParserTest.java:133: cannot find symbol
    [javac] symbol  : method assertNotNull(java.util.Date)
    [javac] location: class mark.util.DateParserTest
    [javac] 		assertNotNull(yesterday);
    [javac] 		^
    [javac] DateParserTest.java:137: cannot find symbol
    [javac] symbol  : method assertEquals(java.lang.String,java.lang.String)
    [javac] location: class mark.util.DateParserTest
    [javac] 		assertEquals(date, "31/12/2000");
    [javac] 		^
    [javac] DateParserTest.java:138: cannot find symbol
    [javac] symbol  : method assertEquals(int,int)
    [javac] location: class mark.util.DateParserTest
    [javac] 		assertEquals(pp.getIndex(), 12);
    [javac] 		^
    [javac] DateParserTest.java:139: cannot find symbol
    [javac] symbol  : method assertEquals(java.lang.Object,java.lang.String)
    [javac] location: class mark.util.DateParserTest
    [javac] 		assertEquals(pp.getFeatures().get("relative"), "past");
    [javac] 		^
    [javac] DateParserTest.java:150: cannot find symbol
    [javac] symbol  : method assertNotNull(java.util.Date)
    [javac] location: class mark.util.DateParserTest
    [javac] 		assertNotNull(lastYear);
    [javac] 		^
    [javac] DateParserTest.java:154: cannot find symbol
    [javac] symbol  : method assertEquals(int,int)
    [javac] location: class mark.util.DateParserTest
    [javac] 		assertEquals(pp.getIndex(), 9);
    [javac] 		^
    [javac] DateParserTest.java:155: cannot find symbol
    [javac] symbol  : method assertEquals(java.lang.String,java.lang.String)
    [javac] location: class mark.util.DateParserTest
    [javac] 		assertEquals(date, "01/01/2000");
    [javac] 		^
    [javac] DateParserTest.java:166: cannot find symbol
    [javac] symbol  : method assertNotNull(java.util.Date)
    [javac] location: class mark.util.DateParserTest
    [javac] 		assertNotNull(nextYear);
    [javac] 		^
    [javac] DateParserTest.java:170: cannot find symbol
    [javac] symbol  : method assertEquals(int,int)
    [javac] location: class mark.util.DateParserTest
    [javac] 		assertEquals(pp.getIndex(), 9);
    [javac] 		^
    [javac] DateParserTest.java:171: cannot find symbol
    [javac] symbol  : method assertEquals(java.lang.String,java.lang.String)
    [javac] location: class mark.util.DateParserTest
    [javac] 		assertEquals(date, "01/01/2002");
    [javac] 		^
    [javac] DateParserTest.java:182: cannot find symbol
    [javac] symbol  : method assertNotNull(java.util.Date)
    [javac] location: class mark.util.DateParserTest
    [javac] 		assertNotNull(lastMonth);
    [javac] 		^
    [javac] DateParserTest.java:186: cannot find symbol
    [javac] symbol  : method assertEquals(int,int)
    [javac] location: class mark.util.DateParserTest
    [javac] 		assertEquals(pp.getIndex(), 10);
    [javac] 		^
    [javac] DateParserTest.java:187: cannot find symbol
    [javac] symbol  : method assertEquals(java.lang.String,java.lang.String)
    [javac] location: class mark.util.DateParserTest
    [javac] 		assertEquals(date, "01/12/2000");
    [javac] 		^
    [javac] DateParserTest.java:198: cannot find symbol
    [javac] symbol  : method assertNotNull(java.util.Date)
    [javac] location: class mark.util.DateParserTest
    [javac] 		assertNotNull(nextMonth);
    [javac] 		^
    [javac] DateParserTest.java:202: cannot find symbol
    [javac] symbol  : method assertEquals(int,int)
    [javac] location: class mark.util.DateParserTest
    [javac] 		assertEquals(pp.getIndex(), 10);
    [javac] 		^
    [javac] DateParserTest.java:203: cannot find symbol
    [javac] symbol  : method assertEquals(java.lang.String,java.lang.String)
    [javac] location: class mark.util.DateParserTest
    [javac] 		assertEquals(date, "01/01/2002");
    [javac] 		^
    [javac] DateParserTest.java:214: cannot find symbol
    [javac] symbol  : method assertNotNull(java.util.Date)
    [javac] location: class mark.util.DateParserTest
    [javac] 		assertNotNull(before);
    [javac] 		^
    [javac] DateParserTest.java:218: cannot find symbol
    [javac] symbol  : method assertEquals(int,int)
    [javac] location: class mark.util.DateParserTest
    [javac] 		assertEquals(pp.getIndex(), 12);
    [javac] 		^
    [javac] DateParserTest.java:219: cannot find symbol
    [javac] symbol  : method assertEquals(java.lang.String,java.lang.String)
    [javac] location: class mark.util.DateParserTest
    [javac] 		assertEquals(sTomorrow, "01/10/2000");
    [javac] 		^
    [javac] DateParserTest.java:228: cannot find symbol
    [javac] symbol  : method assertNotNull(java.util.Date)
    [javac] location: class mark.util.DateParserTest
    [javac] 		assertNotNull(date);
    [javac] 		^
    [javac] DateParserTest.java:230: cannot find symbol
    [javac] symbol  : method assertEquals(int,int)
    [javac] location: class mark.util.DateParserTest
    [javac] 		assertEquals(pp.getIndex(), 7);
    [javac] 		^
    [javac] DateParserTest.java:231: cannot find symbol
    [javac] symbol  : method assertEquals(java.lang.String,java.lang.String)
    [javac] location: class mark.util.DateParserTest
    [javac] 		assertEquals(df.format(date), "31/08/1979");
    [javac] 		^
    [javac] DateParserTest.java:240: cannot find symbol
    [javac] symbol  : method assertNotNull(java.util.Date)
    [javac] location: class mark.util.DateParserTest
    [javac] 		assertNotNull(date);
    [javac] 		^
    [javac] DateParserTest.java:242: cannot find symbol
    [javac] symbol  : method assertEquals(int,int)
    [javac] location: class mark.util.DateParserTest
    [javac] 		assertEquals(pp.getIndex(), 7);
    [javac] 		^
    [javac] DateParserTest.java:243: cannot find symbol
    [javac] symbol  : method assertEquals(java.lang.String,java.lang.String)
    [javac] location: class mark.util.DateParserTest
    [javac] 		assertEquals(df.format(date), "31/08/1979");
    [javac] 		^
    [javac] DateParserTest.java:252: cannot find symbol
    [javac] symbol  : method assertNotNull(java.util.Date)
    [javac] location: class mark.util.DateParserTest
    [javac] 		assertNotNull(date);
    [javac] 		^
    [javac] DateParserTest.java:254: cannot find symbol
    [javac] symbol  : method assertEquals(int,int)
    [javac] location: class mark.util.DateParserTest
    [javac] 		assertEquals(pp.getIndex(), 8);
    [javac] 		^
    [javac] DateParserTest.java:255: cannot find symbol
    [javac] symbol  : method assertEquals(java.lang.String,java.lang.String)
    [javac] location: class mark.util.DateParserTest
    [javac] 		assertEquals(df.format(date), "31/08/1979");
    [javac] 		^
    [javac] DateParserTest.java:263: cannot find symbol
    [javac] symbol  : method assertNull(java.util.Date)
    [javac] location: class mark.util.DateParserTest
    [javac] 		assertNull(date);
    [javac] 		^
    [javac] DateParserTest.java:274: cannot find symbol
    [javac] symbol  : method assertNotNull(java.util.Date)
    [javac] location: class mark.util.DateParserTest
    [javac] 		assertNotNull(date);
    [javac] 		^
    [javac] DateParserTest.java:276: cannot find symbol
    [javac] symbol  : method assertEquals(int,int)
    [javac] location: class mark.util.DateParserTest
    [javac] 		assertEquals(pp.getIndex(), 12);
    [javac] 		^
    [javac] DateParserTest.java:277: cannot find symbol
    [javac] symbol  : method assertEquals(java.lang.String,java.lang.String)
    [javac] location: class mark.util.DateParserTest
    [javac] 		assertEquals(df.format(date), "01/01/2005");
    [javac] 		^
    [javac] DateParserTest.java:286: cannot find symbol
    [javac] symbol  : method assertNotNull(java.util.Date)
    [javac] location: class mark.util.DateParserTest
    [javac] 		assertNotNull(date);
    [javac] 		^
    [javac] DateParserTest.java:288: cannot find symbol
    [javac] symbol  : method assertEquals(int,int)
    [javac] location: class mark.util.DateParserTest
    [javac] 		assertEquals(pp.getIndex(), 8);
    [javac] 		^
    [javac] DateParserTest.java:289: cannot find symbol
    [javac] symbol  : method assertEquals(java.lang.String,java.lang.String)
    [javac] location: class mark.util.DateParserTest
    [javac] 		assertEquals(df.format(date), "09/11/2003");
    [javac] 		^
    [javac] DateParserTest.java:298: cannot find symbol
    [javac] symbol  : method assertNotNull(java.util.Date)
    [javac] location: class mark.util.DateParserTest
    [javac] 		assertNotNull(date);
    [javac] 		^
    [javac] DateParserTest.java:300: cannot find symbol
    [javac] symbol  : method assertEquals(int,int)
    [javac] location: class mark.util.DateParserTest
    [javac] 		assertEquals(pp.getIndex(), 18);
    [javac] 		^
    [javac] DateParserTest.java:301: cannot find symbol
    [javac] symbol  : method assertEquals(java.lang.String,java.lang.String)
    [javac] location: class mark.util.DateParserTest
    [javac] 		assertEquals(df.format(date), "09/11/2003");
    [javac] 		^
    [javac] DateParserTest.java:310: cannot find symbol
    [javac] symbol  : method assertNotNull(java.util.Date)
    [javac] location: class mark.util.DateParserTest
    [javac] 		assertNotNull(date);
    [javac] 		^
    [javac] DateParserTest.java:312: cannot find symbol
    [javac] symbol  : method assertEquals(int,int)
    [javac] location: class mark.util.DateParserTest
    [javac] 		assertEquals(pp.getIndex(), 10);
    [javac] 		^
    [javac] DateParserTest.java:313: cannot find symbol
    [javac] symbol  : method assertEquals(java.lang.String,java.lang.String)
    [javac] location: class mark.util.DateParserTest
    [javac] 		assertEquals(df.format(date), "09/11/2003");
    [javac] 		^
    [javac] DateParserTest.java:324: cannot find symbol
    [javac] symbol  : method assertNotNull(java.util.Date)
    [javac] location: class mark.util.DateParserTest
    [javac] 		assertNotNull(date);
    [javac] 		^
    [javac] DateParserTest.java:326: cannot find symbol
    [javac] symbol  : method assertEquals(int,int)
    [javac] location: class mark.util.DateParserTest
    [javac] 		assertEquals(pp.getIndex(), 6);
    [javac] 		^
    [javac] DateParserTest.java:327: cannot find symbol
    [javac] symbol  : method assertEquals(java.lang.String,java.lang.String)
    [javac] location: class mark.util.DateParserTest
    [javac] 		assertEquals(df.format(date), "01/08/2001");
    [javac] 		^
    [javac] DateParserTest.java:338: cannot find symbol
    [javac] symbol  : method assertNotNull(java.util.Date)
    [javac] location: class mark.util.DateParserTest
    [javac] 		assertNotNull(date);
    [javac] 		^
    [javac] DateParserTest.java:340: cannot find symbol
    [javac] symbol  : method assertEquals(int,int)
    [javac] location: class mark.util.DateParserTest
    [javac] 		assertEquals(pp.getIndex(), 6);
    [javac] 		^
    [javac] DateParserTest.java:341: cannot find symbol
    [javac] symbol  : method assertEquals(java.lang.String,java.lang.String)
    [javac] location: class mark.util.DateParserTest
    [javac] 		assertEquals(df.format(date), "11/03/2001");
    [javac] 		^
    [javac] 94 errors

BUILD FAILED
/data/live/Hudson/jobs/Date Parser/workspace/build.xml:67: Compile failed; see the compiler error output for details.

Total time: 10 seconds
Build step 'Invoke Ant' marked build as failure
[FINDBUGS] Skipping publisher since build result is FAILURE
[WARNINGS] Skipping publisher since build result is FAILURE
Recording test results
Publishing Javadoc
Finished: FAILURE