FailedConsole Output

View as plain text
Started by user Mark Greenwood
ln -s 2013-11-03_18-19-12 /data/live/Hudson/jobs/USBSerial For Arduino/builds/1 failed: -1 
Checking out a fresh workspace because there's no workspace at /data/live/Hudson/jobs/USBSerial For Arduino/workspace
Cleaning workspace /data/live/Hudson/jobs/USBSerial For Arduino/workspace
Checking out file:///data/live/SVN/external/open-source/blog-code/arduino/libraries/USBSerial/host-software/java
A         test
A         test/src
A         test/src/englishcoffeedrinker
A         test/src/englishcoffeedrinker/arduino
A         test/src/englishcoffeedrinker/arduino/USBSerialTester.java
A         License.txt
A         src
A         src/englishcoffeedrinker
A         src/englishcoffeedrinker/arduino
A         src/englishcoffeedrinker/arduino/USBSerial.java
A         src/englishcoffeedrinker/arduino/USBSerialMonitor.java
A         lib
AU        lib/hidapi-1.1.jar
A         build.xml
A         .project
A         docs
A         .classpath
At revision 632
[workspace] $ ant -Dfindbugs.home=/opt/findbugs clean findbugs javadoc
Buildfile: /data/live/Hudson/jobs/USBSerial For Arduino/workspace/build.xml

clean:

prepare:
    [mkdir] Created dir: /data/live/Hudson/jobs/USBSerial For Arduino/workspace/classes

compile:
    [javac] /data/live/Hudson/jobs/USBSerial For Arduino/workspace/build.xml:43: warning: 'includeantruntime' was not set, defaulting to build.sysclasspath=last; set to false for repeatable builds
    [javac] Compiling 2 source files to /data/live/Hudson/jobs/USBSerial For Arduino/workspace/classes
    [javac] warning: [path] bad path element "/usr/share/java/xml-apis-ext.jar,": no such file or directory
    [javac] warning: [path] bad path element "/usr/share/java/xml-resolver.jar,": no such file or directory
    [javac] 2 warnings

jar:
      [jar] Building jar: /data/live/Hudson/jobs/USBSerial For Arduino/workspace/usbserial4arduino.jar

findbugs:
 [findbugs] Executing findbugs from ant task
 [findbugs] Running FindBugs...
 [findbugs] Warnings generated: 1
 [findbugs] Calculating exit code...
 [findbugs] Setting 'bugs found' flag (1)
 [findbugs] Exit code set to: 1
 [findbugs] Java Result: 1
 [findbugs] Output saved to /data/live/Hudson/jobs/USBSerial For Arduino/workspace/findbugs.xml

prepare:

compile:
    [javac] /data/live/Hudson/jobs/USBSerial For Arduino/workspace/build.xml:43: warning: 'includeantruntime' was not set, defaulting to build.sysclasspath=last; set to false for repeatable builds

jar:

BUILD FAILED
/data/live/Hudson/jobs/USBSerial For Arduino/workspace/build.xml:51: Property 'lib.list' already set!

Total time: 9 seconds
Build step 'Invoke Ant' marked build as failure
[FINDBUGS] Skipping publisher since build result is FAILURE
[WARNINGS] Skipping publisher since build result is FAILURE
Recording test results
Publishing Javadoc
Finished: FAILURE