FailedConsole Output

View as plain text
Started by user Mark Greenwood
ln -s 2013-11-03_18-32-21 /data/live/Hudson/jobs/USBSerial For Arduino/builds/6 failed: -1 
Updating file:///data/live/SVN/external/open-source/blog-code/arduino/libraries/USBSerial/host-software/java
At revision 634
no change for file:///data/live/SVN/external/open-source/blog-code/arduino/libraries/USBSerial/host-software/java since the previous build
[workspace] $ ant -Dfindbugs.home=/opt/findbugs clean findbugs javadoc
Buildfile: /data/live/Hudson/jobs/USBSerial For Arduino/workspace/build.xml

clean:
   [delete] Deleting directory /data/live/Hudson/jobs/USBSerial For Arduino/workspace/classes
   [delete] Deleting directory /data/live/Hudson/jobs/USBSerial For Arduino/workspace/docs/javadoc
   [delete] Deleting: /data/live/Hudson/jobs/USBSerial For Arduino/workspace/usbserial4arduino.jar
   [delete] Deleting: /data/live/Hudson/jobs/USBSerial For Arduino/workspace/findbugs.xml

prepare:
    [mkdir] Created dir: /data/live/Hudson/jobs/USBSerial For Arduino/workspace/classes

compile:
    [javac] /data/live/Hudson/jobs/USBSerial For Arduino/workspace/build.xml:47: warning: 'includeantruntime' was not set, defaulting to build.sysclasspath=last; set to false for repeatable builds
    [javac] Compiling 2 source files to /data/live/Hudson/jobs/USBSerial For Arduino/workspace/classes

jar:
      [jar] Building jar: /data/live/Hudson/jobs/USBSerial For Arduino/workspace/usbserial4arduino.jar

findbugs:
 [findbugs] Executing findbugs from ant task
 [findbugs] Running FindBugs...
 [findbugs] Warnings generated: 1
 [findbugs] Calculating exit code...
 [findbugs] Setting 'bugs found' flag (1)
 [findbugs] Exit code set to: 1
 [findbugs] Java Result: 1
 [findbugs] Output saved to /data/live/Hudson/jobs/USBSerial For Arduino/workspace/findbugs.xml

prepare:

compile:
    [javac] /data/live/Hudson/jobs/USBSerial For Arduino/workspace/build.xml:47: warning: 'includeantruntime' was not set, defaulting to build.sysclasspath=last; set to false for repeatable builds

jar:

javadoc:
  [javadoc] Generating Javadoc
  [javadoc] Javadoc execution
  [javadoc] Creating destination directory: "/data/live/Hudson/jobs/USBSerial For Arduino/workspace/docs/javadoc/"
  [javadoc] Loading source files for package englishcoffeedrinker.arduino...
  [javadoc] Constructing Javadoc information...
  [javadoc] Standard Doclet version 1.6.0_27
  [javadoc] Building tree for all the packages and classes...
  [javadoc] Building index for all the packages and classes...
  [javadoc] Building index for all classes...

BUILD SUCCESSFUL
Total time: 12 seconds
[FINDBUGS] Collecting findbugs analysis files...
[FINDBUGS] Successfully parsed file /data/live/Hudson/jobs/USBSerial For Arduino/workspace/findbugs.xml of module  with 1 warnings.
[FINDBUGS] Using set difference to compute new warnings
[FINDBUGS] Setting build status to FAILURE since total number of annotations exceeds the threshold 0: [HIGH, NORMAL, LOW]
Build step 'Publish FindBugs analysis results' changed build result to FAILURE
[WARNINGS] Skipping publisher since build result is FAILURE
Publishing Javadoc
Finished: FAILURE